Title,First Name,Middle Name,Last Name,Suffix,Company,Department,Job Title,Business Street,Business Street 2,Business Street 3,Business City,Business State,Business Postal Code,Business Country/Region,Home Street,Home Street 2,Home Street 3,Home City,Home State,Home Postal Code,Home Country/Region,Other Street,Other Street 2,Other Street 3,Other City,Other State,Other Postal Code,Other Country/Region,Assistant's Phone,Business Fax,Business Phone,Business Phone 2,Callback,Car Phone,Company Main Phone,Home Fax,Home Phone,Home Phone 2,ISDN,Mobile Phone,Other Fax,Other Phone,Pager,Primary Phone,Radio Phone,TTY/TDD Phone,Telex,Account,Anniversary,Assistant's Name,Billing Information,Birthday,Business Address PO Box,Categories,Children,Directory Server,E-mail Address,E-mail Type,E-mail Display Name,E-mail 2 Address,E-mail 2 Type,E-mail 2 Display Name,E-mail 3 Address,E-mail 3 Type,E-mail 3 Display Name,Gender,Government ID Number,Hobby,Home Address PO Box,Initials,Internet Free Busy,Keywords,Language,Location,Manager's Name,Mileage,Notes,Office Location,Organizational ID Number,Other Address PO Box,Priority,Private,Profession,Referred By,Sensitivity,Spouse,User 1,User 2,User 3,User 4,Web Page
,24,,Theya,,,,,,,,,,,,,,,,,,,,,,,,,,,,,,,,,,,,,9177232234,,,,,,,,,0/0/00,,,0/0/00,,,,,,,,,,,,,,Unspecified,,,,,,,,,,,,,,,Low,,,,Normal,,,,,,
,64,,pizza,,,,,,,,,,,,,,,,,,,,,,,,,,,,,,,,,,,,,7187485860,,,,,,,,,0/0/00,,,0/0/00,,Food,,,,,,,,,,,,Unspecified,,,,,,,,,,,,,,,Low,,,,Normal,,,,,,
,411,,,,,,,,,,,,,,,,,,,,,,,,,,,,,,8003733411,,,,,,,,,,,,,,,,,,0/0/00,,,0/0/00,,,,,,,,,,,,,,Unspecified,,,,,,,,,,,,,,,Low,,,,Normal,,,,,,
,4710,,Ireana,,,,,,,,,,,,,,,,,,,,,,,,,,,,,,,,,,,,,17186644971,,,,,,,,,0/0/00,,,0/0/00,,,,,,,,,,,,,,Unspecified,,,,,,,,,,,,,,,Low,,,,Normal,,,,,,
,(Joe) YUN,,ZHOU,,,,,"


",,,,,,,"


",,,,,,,,,,,,,,,,,,,,,,,,,,,,,,,,,,0/0/00,,,0/0/00,,,,,joe14426@gmail.com,SMTP,(Joe) YUN ZHOU (joe14426@gmail.com),,,,,,,Unspecified,,,,,,,,,,,,,,,Low,,,,Normal,,,,,,
,12th st. 3ave,,La flor del paraiso,,,,,,,,,,,,,,,,,,,,,,,,,,,,7189659674,,,,,,,,,,,,,,,,,,0/0/00,,,0/0/00,,Food,,,,,,,,,,,,Unspecified,,,,,,,,,,,,,,,Low,,,,Normal,,,,,,
,1623 91 st maintenance,,,,1623 91 st maintenance,,,,,,,,,,,,,,,,,,,,,,,,,,19734328633,,,,,,,,,,,,,,,,,,0/0/00,,,0/0/00,,,,,,,,,,,,,,Unspecified,,,,,,,,,,,,,,,Low,,,,Normal,,,,,,
,1623 91th  st  front lobby,,,,,,,,,,,,,,,,,,,,,,,,,,,,,,+1 2123489255,,,,,,,,,,,,,,,,,,0/0/00,,,0/0/00,,,,,,,,,,,,,,Unspecified,,,,,,,,,,,,,,,Low,,,,Normal,,,,,,
,16th st & 3rd ave,,Hector,,,,,,,,,,,,,,,,,,,,,,,,,,,,,,,,,,,,,9177473877,,,,,,,,,0/0/00,,,0/0/00,,,,,,,,,,,,,,Unspecified,,,,,,,,,,,,,,,Low,,,,Normal,,,,,,
,1A,,Alex,,,,,,,,,,,,,,,,,,,,,,,,,,,,,,,,,,17188710560,,,13472682282,,,,,,,,,0/0/00,,,0/0/00,,,,,,,,,,,,,,Unspecified,,,,,,,,,,,,,,,Low,,,,Normal,,,,,,
,1B,,Elias,,,,,,,,,,,,,,,,,,,,,,,,,,,,,,,,,,3477601523,,,17186005246,,,,,,,,,0/0/00,,,0/0/00,,,,,,,,,,,,,,Unspecified,,,,,,,,,,,,,,,Low,,,,Normal,,,,,,
,1F,,June perez,,,,,,,,,,,,,,,,,,,,,,,,,,,,,,,,,,7186333851,,,9176582477,,,,,,,,,0/0/00,,,0/0/00,,,,,,,,,,,,,,Unspecified,,,,,,,,,,,,,,,Low,,,,Normal,,,,,,
,22nd and 6th ave,,Mike: owner of,,,,,,,,,,,,,,,,,,,,,,,,,,,,,,,,,,,,,19176138265,,,,,,,,,0/0/00,,,0/0/00,,,,,,,,,,,,,,Unspecified,,,,,,,,,,,,,,,Low,,,,Normal,,,,,,
,23rd snd 5th ave Chinese food snd,5th,ave,,,,,,,,,,,,,,,,,,,,,,,,,,,,,,,,,,,,,,,,,,,,,,0/0/00,,,0/0/00,,Food,,,,,,,,,,,,Unspecified,,,,,,,,,,,,,,,Low,,,,Normal,,,,,,
,25TH Street Building Material,,Inc,,25TH Street Building Material Inc,,,754 3rd Ave,,,Brooklyn,NY,11232-1420,United States,,,,,,,,,,,,,,,,,7188322388,,,,,,,,,,,,,,,,,,0/0/00,,,0/0/00,,Construction Materials Vendor,,,,,,,,,,,,Unspecified,,,,,,,,,,,,,,,Low,,,,Normal,,,,,,
,2B,,Pedro,,,,,,,,,,,,,,,,,,,,,,,,,,,,,,,,,,3475458913,,,16467147114,,,,,,,,,0/0/00,,,0/0/00,,,,,,,,,,,,,,Unspecified,,,,,,,,,,,,,,,Low,,,,Normal,,,,,,
,2F,,Clara rodriguez,,,,,,,,,,,,,,,,,,,,,,,,,,,,,,,,,,7184353927,,,,,,,,,,,,0/0/00,,,0/0/00,,,,,,,,,,,,,,Unspecified,,,,,,,,,,,,,,,Low,,,,Normal,,,,,,
,2f,,Steve,,,,,,,,,,,,,,,,,,,,,,,,,,,,,,,,,,,,,5183213539,,,,,,,,,0/0/00,,,0/0/00,,,,,,,,,,,,,,Unspecified,,,,,,,,,,,,,,,Low,,,,Normal,,,,,,
,2f tenant,,Brian,,,,,,,,,,,,,,,,,,,,,,,,,,,,,,,,,,,,,3154274514,,,,,,,,,0/0/00,,,0/0/00,,,,,,,,,,,,,,Unspecified,,,,,,,,,,,,,,,Low,,,,Normal,,,,,,
,32 hour scaffold instructor John hour,scaffold,instructor,,,,,,,,,,,,,,,,,,,,,,,,,,,,,,,,,,,,,,,,,,,,,,0/0/00,,,0/0/00,,Training,,,,,,,,,,,,Unspecified,,,,,,,,,,,,,,,Low,,,,Normal,,,,,,
,3B,,Emilsa medina,,,,,,,,,,,,,,,,,,,,,,,,,,,,9178552721,,,,,,7186331891,,,,,,,,,,,,0/0/00,,,0/0/00,,,,,,,,,,,,,,Unspecified,,,,,,,,,,,,,,,Low,,,,Normal,,,,,,
,3b,,Edgar,,,,,,,,,,,,,,,,,,,,,,,,,,,,13476158435,,,,,,,,,,,,,,,,,,0/0/00,,,0/0/00,,,,,,,,,,,,,,Unspecified,,,,,,,,,,,,,,,Low,,,,Normal,,,,,,
,3F,Donald,scott,,,,,,,,,,,,,,,,,,,,,,,,,,,,,,,,,,7184375969,,,,,,,,,,,,0/0/00,,,0/0/00,,,,,,,,,,,,,,Unspecified,,,,,,,,,,,,,,,Low,,,,Normal,,,,,,
,46&7,,Moses,,,,,,,,,,,,,,,,,,,,,,,,,,,,17184070362,,,,,,,,,,,,,,,,,,0/0/00,,,0/0/00,,,,,,,,,,,,,,Unspecified,,,,,,,,,,,,,,,Low,,,,Normal,,,,,,
,46th st. & 5th,,El bohio,,,,,,,,,,,,,,,,,,,,,,,,,,,,,,,,,,,,,17186860079,,,,,,,,,0/0/00,,,0/0/00,,,,,,,,,,,,,,Unspecified,,,,,,,,,,,,,,,Low,,,,Normal,,,,,,
,4B,,Germania Santos,,,,,,,,,,,,,,,,,,,,,,,,,,,,,,,,,,17186888807,,,,,,,,,,,,0/0/00,,,0/0/00,,,,,,,,,,,,,,Unspecified,,,,,,,,,,,,,,,Low,,,,Normal,,,,,,
,4F,,Ricardo,,,,,,,,,,,,,,,,,,,,,,,,,,,,6464152992,,,,,,7188715125,,,,,,,,,,,,0/0/00,,,0/0/00,,,,,,,,,,,,,,Unspecified,,,,,,,,,,,,,,,Low,,,,Normal,,,,,,
,4F,,Ana Taveras,,,,,,,,,,,,,,,,,,,,,,,,,,,,17188715125,,,,,,,,,,,,,,,,,,0/0/00,,,0/0/00,,,,,,,,,,,,,,Unspecified,,,,,,,,,,,,,,,Low,,,,Normal,,,,,,
,51  and 10th,,House,,,,,,,,,,,,,,,,,,,,,,,,,,,,15169025311,,,,,,,,,,,,,,,,,,0/0/00,,,0/0/00,,,,,,,,,,,,,,Unspecified,,,,,,,,,,,,,,,Low,,,,Normal,,,,,,
,514 3f,Tenant,2016,,,,,,,,,,,,,,,,,,,,,,,,,,,,,,,,,,,,,14125089461,,,,,,,,,0/0/00,,,0/0/00,,,,,,,,,,,,,,Unspecified,,,,,,,,,,,,,,,Low,,,,Normal,,,,,,
,514 46 st,,2f tenant,,,,,,,,,,,,,,,,,,,,,,,,,,,,,,,,,,,,,13475265583,,,,,,,,,0/0/00,,,0/0/00,,,,,,,,,,,,,,Unspecified,,,,,,,,,,,,,,,Low,,,,Normal,,,,,,
,54&3.Jose's boy,,Jose,,,,,,,,,,,,,,,,,,,,,,,,,,,,,,,,,,,,,13476801893,,,,,,,,,0/0/00,,,0/0/00,,,,,,,,,,,,,,Unspecified,,,,,,,,,,,,,,,Low,,,,Normal,,,,,,
,54&3.jose's boy,,Alex,,,,,,,,,,,,,,,,,,,,,,,,,,,,,,,,,,,,,16467211764,,,,,,,,,0/0/00,,,0/0/00,,,,,,,,,,,,,,Unspecified,,,,,,,,,,,,,,,Low,,,,Normal,,,,,,
,54&7,,Chinese Tommy,,,,,,,,,,,,,,,,,,,,,,,,,,,,,,,,,,,,,13475565688,,,,,,,,,0/0/00,,,0/0/00,,,,,,,,,,,,,,Unspecified,,,,,,,,,,,,,,,Low,,,,Normal,,,,,,
,578 3rd ave,,Chinese food,,,,,,,,,,,,,,,,,,,,,,,,,,,,17189651668,,,,,,,,,,,,,,,,,,0/0/00,,,0/0/00,,,,,,,,,,,,,,Unspecified,,,,,,,,,,,,,,,Low,,,,Normal,,,,,,
,6th st iron and metal scrap,,,,6th st iron and metal scrap,,,,,,,,,,,,,,,,,,,,,,,,,,718 222 3133,,,,,,,,,,,,,,,,,,0/0/00,,,0/0/00,,Construction Materials Vendor,,,,,,,,,,,,Unspecified,,,,,,,,,,,,,,,Low,,,,Normal,,,,,,
,A & D Iron Works Inc,,,,A & D Iron Works Inc,,,305 24th St,,,Brooklyn,NY,11232-1309,United States,,,,,,,,,,,,,,,,,7184924330,,,,,,,,,,,,,,,,,,0/0/00,,,0/0/00,,Steel,,,,,,,,,,,,Unspecified,,,,,,,,,,,,,,,Low,,,,Normal,,,,,,
,A&S Printing Co.,,,,,,,,,,"Neptune Ave Brooklyn, NY 11235",,193,,,,,,,,,,,,,,,,,(718) 743-6073,(718) 743-6070,,,,,,,,,,,,,,,,,,0/0/00,,,0/0/00,,Printing,,,asaprinting@yahoo.com,SMTP,A&S Printing Co. (asaprinting@yahoo.com),,,,,,,Unspecified,,,,,,,,,,,,,,,Low,,,,Normal,,,,,,
,AA Committee,,Aissata,,,,,,,,,,,,,,,,,,,,,,,,,,,,,,,,,,,,,13477309925,,,,,,,,,0/0/00,,,0/0/00,,,,,,,,,,,,,,Unspecified,,,,,,,,,,,,,,,Low,,,,Normal,,,,,,
,AA Committee,,Aissata,,,,,,,,,,,,,,,,,,,,,,,,,,,,,,,,,,,,,13477309925,,,,,,,,,0/0/00,,,0/0/00,,,,,,,,,,,,,,Unspecified,,,,,,,,,,,,,,,Low,,,,Normal,,,,,,
,Aaron,,Building material supplier,,,,,,,,,,,,,,,,,,,,,,,,,,,,7185357700,,,,,,8456623609,,,,,,,,,,,,0/0/00,,,0/0/00,,Construction Materials Vendor,,,aaron@buildingpriority.com,SMTP,Aaron Building material supplier (aaron@buildingpriority.com),,,,,,,Unspecified,,,,,,,,,,,,,,,Low,,,,Normal,,,,,,
,Abdul,,Hannan,,,,,,,,,,,,,,,,,,,,,,,,,,,,,,,,,,,,,,,,,,,,,,0/0/00,,,0/0/00,,Completed-Project,,,ahannan@hotmail.com,SMTP,Abdul Hannan (ahannan@hotmail.com),,,,,,,Unspecified,,,,,,,,,,,,,,,Low,,,,Normal,,,,,,
,Abdul,,E15 st.,,,,,,,,,,,,,,,,,,,,,,,,,,,,3478630585,,,,,,7182524074,,,,,,,,,,,,0/0/00,,,0/0/00,,Completed-Project,,,ahannan@hotmail.com,SMTP,Abdul E15 st. (ahannan@hotmail.com),,,,,,,Unspecified,,,,,,,,,,,,,,,Low,,,,Normal,,,,,,
,Abdula,,44th street and 8th ave,,,,,,,,,,,,,,,,,,,,,,,,,,,,13476409073,,,,,,,,,,,,,,,,,,0/0/00,,,0/0/00,,,,,,,,,,,,,,Unspecified,,,,,,,,,,,,,,,Low,,,,Normal,,,,,,
,Abide Turkish. Usual Cuisine. 8th And 7th,,Ave,,,,,,,,,,,,,,,,,,,,,,,,,,,,,,,,,,,,,(718) 832-7482,,,,,,,,,0/0/00,,,0/0/00,,Food,,,,,,,,,,,,Unspecified,,,,,,,,,,,,,,,Low,,,,Normal,,,,,,
,Abuud,,24,,,,,,,,,,,,,,,,,,,,,,,,,,,,7182162356,,,,,,,,,,,,,,,,,,0/0/00,,,0/0/00,,,,,,,,,,,,,,Unspecified,,,,,,,,,,,,,,,Low,,,,Normal,,,,,,
,AC,,1,,,,,,,,,,,,,,,,,,,,,,,,,,,,,,,,,,,,,6463389922,,,,,,,,,0/0/00,,,0/0/00,,,,,,,,,,,,,,Unspecified,,,,,,,,,,,,,,,Low,,,,Normal,,,,,,
,Academic. affairs,,Baruch,,,,,,,,,,,,,,,,,,,,,,,,,,,,,,,,,,,,,,,,,,,,,,0/0/00,,,0/0/00,,,,,baruchacademicaffairs@gmail.com,SMTP,Academic. affairs Baruch (baruchacademicaffairs@gmail.com),,,,,,,Unspecified,,,,,,,,,,,,,,,Low,,,,Normal,,,,,,
,Acapulco Express,,,,Acapulco Express,,,3921 5th Ave,,,Brooklyn,NY,11232-2925,United States,,,,,,,,,,,,,,,,,718-230-1400,,,,,,,,,,,,,,,,,,0/0/00,,,0/0/00,,car service,,,,,,,,,,,,Unspecified,,,,,,,,,,,,,,,Low,,,,Normal,,,,,,
,Account,,Jim Chen,,,,,,,,,,,,,,,,,,,,,,,,,,,,,,,,,,,,,7184388001,,,,,,,,,0/0/00,,,0/0/00,,,,,,,,,,,,,,Unspecified,,,,,,,,,,,,,,,Low,,,,Normal,,,,,,
,Accountant,,Diana White,,,,,,,,,,,,,,,,,,,,,,,,,,,,7188757111,,,,,,,,,9178868052,,,,,,,,,0/0/00,,,0/0/00,,accountant,,,,,,,,,,,,Unspecified,,,,,,,,,,,,,,,Low,,,,Normal,,,,,,
,Accurate,,Precast,,Accurate Precast,,,1957 Pitkin Ave,,,Brooklyn,NY,11207-3305,United States,,,,,,,,,,,,,,,,,718-345-2910,,,,,,,,,,,,,,,,,,0/0/00,,,0/0/00,,Concrete,,,,,,,,,,,,Unspecified,,,,,,,,,,,,,,,Low,,,,Normal,,,,,,
,Aco- del construction,,Adriana,,,,,,,,,,,,,,,,,,,,,,,,,,,,,,,,,,,,,13474591556,,,,,,,,,0/0/00,,,0/0/00,,,,,,,,,,,,,,Unspecified,,,,,,,,,,,,,,,Low,,,,Normal,,,,,,
,Action,,Jackson,,,,,,,,,,,,,,,,,,,,,,,,,,,,,,,,,,,,,9179740860,,,,,,,,,0/0/00,,,0/0/00,,,,,,,,,,,,,,Unspecified,,,,,,,,,,,,,,,Low,,,,Normal,,,,,,
,Ada,,Emmons,,,,,,,,,,,,,,,,,,,,,,,,,,,,,,,,,,,,,,,,,,,,,,0/0/00,,,0/0/00,,,,,AdaEmmons711@yahoo.com,SMTP,Ada Emmons (AdaEmmons711@yahoo.com),,,,,,,Unspecified,,,,,,,,,,,,,,,Low,,,,Normal,,,,,,
,Adam,,Missry,,,,,,,,,,,,,,,,,,,,,,,,,,,,,,,,,,,,,,,,,,,,,,0/0/00,,,0/0/00,,Mortgage broker,,,Adam@universalmortgageinc.com,SMTP,Adam Missry (Adam@universalmortgageinc.com),,,,,,,Unspecified,,,,,,,,,,,,,,,Low,,,,Normal,,,,,,
,Adel,,Sageer,,,,,,,,,,,,,,,,,,,,,,,,,,,,,,,,,,,,,,,,,,,,,,0/0/00,,,0/0/00,,,,,adelsageer@gmail.com,SMTP,Adel Sageer (adelsageer@gmail.com),,,,,,,Unspecified,,,,,,,,,,,,,,,Low,,,,Normal,,,,,,
,Adriana,,Aldarondo,,,,,,,,,,,,,,,,,,,,,,,,,,,,,,,,,,,,,,,,,,,,,,0/0/00,,,0/0/00,,,,,adriana_aldarondo@yahoo.com,SMTP,Adriana Aldarondo (adriana_aldarondo@yahoo.com),,,,,,,Unspecified,,,,,,,,,,,,,,,Low,,,,Normal,,,,,,
,Adriana P,,Hernandez,,,,,,,,,,,,,,,,,,,,,,,,,,,,,,,,,,,,,,,,,,,,,,0/0/00,,,0/0/00,,,,,adrianaphc@msn.com,SMTP,Adriana P Hernandez (adrianaphc@msn.com),,,,,,,Unspecified,,,,,,,,,,,,,,,Low,,,,Normal,,,,,,
,Adrienne,,Faust,,,,,,,,,,,,,,,,,,,,,,,,,,,,,,,,,,,,,,,,,,,,,,0/0/00,,,0/0/00,,,,,AdrienneFaust89@gmail.com,SMTP,Adrienne Faust (AdrienneFaust89@gmail.com),,,,,,,Unspecified,,,,,,,,,,,,,,,Low,,,,Normal,,,,,,
,Aiesha,,Network,,,,,,,,,,,,,,,,,,,,,,,,,,,,,,,,,,,,,,,,,,,,,,0/0/00,,,0/0/00,,,,,bluediamondpa@aol.com,SMTP,Aiesha Network (bluediamondpa@aol.com),bluediamondpa@aol.com,SMTP,Aiesha Network (bluediamondpa@aol.com),bluediamondpa@aol.com,SMTP,Aiesha Network (bluediamondpa@aol.com),Unspecified,,,,,,,,,,,Nickname: Reporter,,,,Low,,,,Normal,,,,,,
,Aissata,,Camara,,,,,,,,,,,,,,,,,,,,,,,,,,,,,,,,,,,,,,,,,,,,,,0/0/00,,,0/0/00,,,,,aissata.camara@students.baruch.cuny.edu,SMTP,Aissata Camara (aissata.camara@students.baruch.cuny.edu),,,,,,,Unspecified,,,,,,,,,,,,,,,Low,,,,Normal,,,,,,
,AJ,,1,,,,,,,,,,,,,,,,,,,,,,,,,,,,,,,,,,,,,19174956383,,,,,,,,,0/0/00,,,0/0/00,,,,,,,,,,,,,,Unspecified,,,,,,,,,,,,,,,Low,,,,Normal,,,,,,
,Akan,,owner of 56,,,,,,,,,,,,,,,,,,,,,,,,,,,,,,,,,,,,,,,,,,,,,,0/0/00,,,0/0/00,,,,,aeoton@optonline.net,SMTP,Akan (aeoton@optonline.net),,,,,,,Unspecified,,,,,,,,,,,,,,,Low,,,,Normal,,,,,,
,Akeno student,,activities,,,,,,,,,,,,,,,,,,,,,,,,,,,,,,,,,,,,,,,,,,,,,,0/0/00,,,0/0/00,,,,,alopez@bmcc.cuny.edu,SMTP,Akeno student activities (alopez@bmcc.cuny.edu),,,,,,,Unspecified,,,,,,,,,,,,,,,Low,,,,Normal,,,,,,
,Al,,Al ike: general helper: $100 a day 8am-5pm,,,,,,,,,,,,,,,,,,,,,,,,,,,,3473018453,,,,,,,,,,,,,,,,,,0/0/00,,,0/0/00,,helper,,,,,,,,,,,,Unspecified,,,,,,,,,,,,,,,Low,,,,Normal,,,,,,
,Alan,,Wallis,,,,,,,,,,,,,,,,,,,,,,,,,,,,12122227912,,,,,,,,,,,,,,,,,,0/0/00,,,0/0/00,,,,,alanwallis@gmail.com,SMTP,Alan Wallis (alanwallis@gmail.com),,,,,,,Unspecified,,,,,,,,,,,,,,,Low,,,,Normal,,,,,,
,Alan from 56 2012,,,,,,,,,,,,,,,,,,,,,,,,,,,,,,3474838589,,,,,,,,,,,,,,,,,,0/0/00,,,0/0/00,,,,,,,,,,,,,,Unspecified,,,,,,,,,,,,,,,Low,,,,Normal,,,,,,
,Alan Rodriguez,,All Around Worker. Installer,,,,,,,,,,,,,,,,,,,,,,,,,,,,,,,,,,,,,7186620371,,,,,,,,,0/0/00,,,0/0/00,,,,,,,,,,,,,,Unspecified,,,,,,,,,,,,,,,Low,,,,Normal,,,,,,
,Alantic,Ready,Mix,,,,,,,,,,,,,,,,,,,,,,,,,,,,,,,,,,,,,1 718-454-0800,,,,,,,,,0/0/00,,,0/0/00,,Concrete Ready Mix,,,,,,,,,,,,Unspecified,,,,,,,,,,,,,,,Low,,,,Normal,,,,,,
,Alejandra,,Duffoo,,,,,,,,,,,,,,,,,,,,,,,,,,,,,,,,,,,,,15163418386,,,,,,,,,0/0/00,,,0/0/00,,,,,alejandra.d@boroughconstruction.com,SMTP,Alejandra Duffoo (alejandra.d@boroughconstruction.com),,,,,,,Unspecified,,,,,,,,,,,,,,,Low,,,,Normal,,,,,,
,Ales from,,strata,,,,,,,,,,,,,,,,,,,,,,,,,,,,,,,,,,,,,16463005872,,,,,,,,,0/0/00,,,0/0/00,,,,,,,,,,,,,,Unspecified,,,,,,,,,,,,,,,Low,,,,Normal,,,,,,
,Alex,,"Carpenter, met at 591 3rd ave, all around carpenter",,,,,,,,,,,,,,,,,,,,,,,,,,,,13477653633,,,,,,,,,,,,,,,,,,0/0/00,,,0/0/00,,,,,,,,,,,,,,Unspecified,,,,,,,,,,,,,,,Low,,,,Normal,,,,,,
,Alex,,Perubian,,,,,,,,,,,,,,,,,,,,,,,,,,,,17187153135,,,,,,,,,,,,,,,,,,0/0/00,,,0/0/00,,,,,,,,,,,,,,Unspecified,,,,,,,,,,,,,,,Low,,,,Normal,,,,,,
,Alex,,Appliance repair,,,,,,,,,,,,,,,,,,,,,,,,,,,,9175958687,,,,,,,,,,,,,,,,,,0/0/00,,,0/0/00,,Appliances Repair,,,,,,,,,,,,Unspecified,,,,,,,,,,,,,,,Low,,,,Normal,,,,,,
,Alex,,1A,,,,,,,,,,,,,,,,,,,,,,,,,,,,,,,,,,,,,6467525427,,,,,,,,,0/0/00,,,0/0/00,,,,,,,,,,,,,,Unspecified,,,,,,,,,,,,,,,Low,,,,Normal,,,,,,
,Alex,General,Helper,,,,,,,,,,,,,,,,,,,,,,,,,,,,,,,,,,,,,13478985668,,,,,,,,,0/0/00,,,0/0/00,,helper,,,,,,,,,,,,Unspecified,,,,,,,,,,,,,,,Low,,,,Normal,,,,,,
,Alex,,PIGATTO,,,,,,,,,,,,,,,,,,,,,,,,,,,,,,,,,,,,,,,,,,,,,,0/0/00,,,0/0/00,,Completed-Project,,,alex.pigatto@us.bnpparibas.com,SMTP,Alex PIGATTO (alex.pigatto@us.bnpparibas.com),,,,,,,Unspecified,,,,,,,,,,,,,,,Low,,,,Normal,,,,,,
,Alex Super,,For 151-15 howard beach,,,,,,,,,,,,,,,,,,,,,,,,,,,,17187174613,,,,,,,,,,,,,,,,,,0/0/00,,,0/0/00,,Skilled trades,,,,,,,,,,,,Unspecified,,,,,,,,,,,,,,,Low,,,,Normal,,,,,,
,Alexa,,Holloween party 9th st.,,,,,,,,,,,,,,,,,,,,,,,,,,,,9177715526,,,,,,,,,,,,,,,,,,0/0/00,,,0/0/00,,,,,,,,,,,,,,Unspecified,,,,,,,,,,,,,,,Low,,,,Normal,,,,,,
,Alexander,,Gizersky,,,,,,,,,,,,,,,,,,,,,,,,,,,,,,,,,,,,,,,,,,,,,,0/0/00,,,0/0/00,,,,,alexg339@yahoo.com,SMTP,Alexander Gizersky (alexg339@yahoo.com),,,,,,,Unspecified,,,,,,,,,,,,,,,Low,,,,Normal,,,,,,
,Alexander,,Sanchez,,,,,,,,,,,,,,,,,,,,,,,,,,,,,,,,,,,,,,,,,,,,,,0/0/00,,,0/0/00,,,,,esq40@hotmail.com,SMTP,Alexander Sanchez (esq40@hotmail.com),,,,,,,Unspecified,,,,,,,,,,,,,,,Low,,,,Normal,,,,,,
,Alexis insdus.,org.,psy,,,,,,,,,,,,,,,,,,,,,,,,,,,,,,,,,,,,,14078088650,,,,,,,,,0/0/00,,,0/0/00,,,,,,,,,,,,,,Unspecified,,,,,,,,,,,,,,,Low,,,,Normal,,,,,,
,Alexromao@aol.com,,,,,,,,,,,,,,,,,,,,,,,,,,,,,,,,,,,,,,,,,,,,,,,,0/0/00,,,0/0/00,,,,,Alexromao@aol.com,SMTP,Alexromao@aol.com (Alexromao@aol.com),,,,,,,Unspecified,,,,,,,,,,,,,,,Low,,,,Normal,,,,,,
,"Alfredo, framing drywall, compound",,"Carpenter, jamacia queens",,,,,,,,,,,,,,,,,,,,,,,,,,,,3477068649,,,,,,,,,,,,,,,,,,0/0/00,,,0/0/00,,Carpentry,,,,,,,,,,,,Unspecified,,,,,,,,,,,,,,,Low,,,,Normal,,,,,,
,Alina,,AF charter school,,,,,,,,,,,,,,,,,,,,,,,,,,,,3478380205,,,,,,,,,,,,,,,,,,0/0/00,,,0/0/00,,Completed-Project,,,,,,,,,,,,Unspecified,,,,,,,,,,,,,,,Low,,,,Normal,,,,,,
,Alina,,Yang,,,,,,,,,,,,,,,,,,,,,,,,,,,,,,,,,,,,,,,,,,,,,,0/0/00,,,0/0/00,,,,,alinayang@achievementfirst.org,SMTP,Alina Yang (alinayang@achievementfirst.org),alinayang@achievementfirst.org,SMTP,Alina Yang (alinayang@achievementfirst.org),,,,Unspecified,,,,,,,,,,, ,,,,Low,,,,Normal,,,,,,
,Aliza,,Narine,,,,,,,,,,,,,,,,,,,,,,,,,,,,,,,,,,,,,,,,,,,,,,0/0/00,,,0/0/00,,,,,aliza.narine@baruchmail.cuny.edu,SMTP,Aliza Narine (aliza.narine@baruchmail.cuny.edu),,,,,,,Unspecified,,,,,,,,,,,,,,,Low,,,,Normal,,,,,,
,Alla,,Fin4930,,,,,,,,,,,,,,,,,,,,,,,,,,,,19177679987,,,,,,,,,,,,,,,,,,0/0/00,,,0/0/00,,,,,,,,,,,,,,Unspecified,,,,,,,,,,,,,,,Low,,,,Normal,,,,,,
,Allen from 56,,,,,,,,,,,,,,,,,,,,,,,,,,,,,,,,,,,,3474838589,,,,,,,,,,,,0/0/00,,,0/0/00,,,,,,,,,,,,,,Unspecified,,,,,,,,,,,,,,,Low,,,,Normal,,,,,,
,Allie,,LES,,,,,,,,,,,,,,,,,,,,,,,,,,,,4147329950,,,,,,,,,,,,,,,,,,0/0/00,,,0/0/00,,,,,,,,,,,,,,Unspecified,,,,,,,,,,,,,,,Low,,,,Normal,,,,,,
,Allison,,Frederich,,,,,,,,,,,,,,,,,,,,,,,,,,,,,,,,,,,,,,,,,,,,,,0/0/00,,,0/0/00,,,,,allison.frederich@students.baruch.cuny.edu,SMTP,Allison Frederich (allison.frederich@students.baruch.cuny.edu),,,,,,,Unspecified,,,,,,,,,,,,,,,Low,,,,Normal,,,,,,
,Alona,,Dr.zinberg's office,,,,,,,,,,,,,,,,,,,,,,,,,,,,19173992841,,,,,,,,,,,,,,,,,,0/0/00,,,0/0/00,,,,,,,,,,,,,,Unspecified,,,,,,,,,,,,,,,Low,,,,Normal,,,,,,
,Alona Dr.,zinberg's,office,,,,,,,,,,,,,,,,,,,,,,,,,,,,,,,,,,,,,,,,,,,,,,0/0/00,,,0/0/00,,,,,,,,,,,,,,Unspecified,,,,,,,,,,,,,,,Low,,,,Normal,,,,,,
,alumnicorner@gmail.com,,,,,,,,,,,,,,,,,,,,,,,,,,,,,,,,,,,,,,,,,,,,,,,,0/0/00,,,0/0/00,,,,,alumnicorner@gmail.com,SMTP,alumnicorner@gmail.com (alumnicorner@gmail.com),,,,,,,Unspecified,,,,,,,,,,,,,,,Low,,,,Normal,,,,,,
,Alvin,,Tran,,,,,,,,,,,,,,,,,,,,,,,,,,,,,,,,,,,,,,,,,,,,,,0/0/00,,,0/0/00,,,,,alvin.tran@students.baruch.cuny.edu,SMTP,Alvin Tran (alvin.tran@students.baruch.cuny.edu),,,,,,,Unspecified,,,,,,,,,,,,,,,Low,,,,Normal,,,,,,
,Amanda,,514 2b,,,,,,,,,,,,,,,,,,,,,,,,,,,,+1 9084322196,,,,,,,,,,,,,,,,,,0/0/00,,,0/0/00,,,,,,,,,,,,,,Unspecified,,,,,,,,,,,,,,,Low,,,,Normal,,,,,,
,Amanda,,home,,,,,,,,,,,,,,,,,,,,,,,,,,,,,,,,,,,,,7184970819,,,,,,,,,0/0/00,,,0/0/00,,,,,,,,,,,,,,Unspecified,,,,,,,,,,,,,,,Low,,,,Normal,,,,,,
,Amanda,Chemistry,Class,,,,,,,,,,,,,,,,,,,,,,,,,,,,19176030289,,,,,,,,,1-917-603-0289,,,,,,,,,0/0/00,,,0/0/00,,,,,,,,,,,,,,Unspecified,,,,,,,,,,,,,,,Low,,,,Normal,,,,,,
,Amanda,,DeLuise,,,,,,,,,,,,,,,,,,,,,,,,,,,,,,,,,,,,,,,,,,,,,,0/0/00,,,0/0/00,,,,,amandadeluise@gmail.com,SMTP,Amanda DeLuise (amandadeluise@gmail.com),,,,,,,Unspecified,,,,,,,,,,,,,,,Low,,,,Normal,,,,,,
,amber@standaredlivingrealty.com,,,,,,,,,,,,,,,,,,,,,,,,,,,,,,,,,,,,,,,,,,,,,,,,0/0/00,,,0/0/00,,real estate agent,,,amber@standaredlivingrealty.com,SMTP,amber@standaredlivingrealty.com (amber@standaredlivingrealty.com),,,,,,,Unspecified,,,,,,,,,,,,,,,Low,,,,Normal,,,,,,
,amber@theparknyc.com,,,,,,,,,,,,,,,,,,,,,,,,,,,,,,,,,,,,,,,,,,,,,,,,0/0/00,,,0/0/00,,,,,amber@theparknyc.com,SMTP,amber@theparknyc.com (amber@theparknyc.com),,,,,,,Unspecified,,,,,,,,,,,,,,,Low,,,,Normal,,,,,,
,"Amy ""ah-mi""",,Maxfish,,,,,,,,,,,,,,,,,,,,,,,,,,,,6463163433,,,,,,,,,,,,,,,,,,0/0/00,,,0/0/00,,,,,,,,,,,,,,Unspecified,,,,,,,,,,,,,,,Low,,,,Normal,,,,,,
,Ana,,Taveras,,,,,,,,,,,,,,,,,,,,,,,,,,,,,,,,,,,,,17188715125,,,,,,,,,0/0/00,,,0/0/00,,,,,,,,,,,,,,Unspecified,,,,,,,,,,,,,,,Low,,,,Normal,,,,,,
,Ana Rivera,514,3F,,,,,,,,,,,,,,,,,,,,,,,,,,,,,,,,,,,,,13475745384,,,,,,,,,0/0/00,,,0/0/00,,,,,,,,,,,,,,Unspecified,,,,,,,,,,,,,,,Low,,,,Normal,,,,,,
,Anastasia,,Thanopoulos,,,,,,,,,,,,,,,,,,,,,,,,,,,,,,,,,,,,,,,,,,,,,,0/0/00,,,0/0/00,,,,,ayt@granitemanagement.com,SMTP,Anastasia Thanopoulos (ayt@granitemanagement.com),,,,,,,Unspecified,,,,,,,,,,,,,,,Low,,,,Normal,,,,,,
,Andre,,,,SLR realty,,,,,,,,,,,,,,,,,,,,,,,,,,19174183950,,,,,,,,,,,,,,,,,,0/0/00,,,0/0/00,,Real Estate agent,,,andrerents@gmail.com,SMTP,Andre (andrerents@gmail.com),,,,,,,Unspecified,,,,,,,,,,,,,,,Low,,,,Normal,,,,,,
,Andrew,,Gayle,,,,,,,,,,,,,,,,,,,,,,,,,,,,,,,,,,,,,,,,,,,,,,0/0/00,,,0/0/00,,,,,agayle511@hotmail.com,SMTP,Andrew Gayle (agayle511@hotmail.com),,,,,,,Unspecified,,,,,,,,,,,,,,,Low,,,,Normal,,,,,,
,Andy,,125 w76 st 8c,,,,,,,,,,,,,,,,,,,,,,,,,,,,6469424757,,,,,,,,,,,,,,,,,,0/0/00,,,0/0/00,,,,,,,,,,,,,,Unspecified,,,,,,,,,,,,,,,Low,,,,Normal,,,,,,
,Andy Real Estate,,Instructor,,,,,,,,,,,,,,,,,,,,,,,,,,,,,,,,,,,,,,,,,,,,,,0/0/00,,,0/0/00,,Training,,,andy@reedc.com,SMTP,Andy Real Estate Instructor (andy@reedc.com),,,,,,,Unspecified,,,,,,,,,,,,,,,Low,,,,Normal,,,,,,
,Angel,Helper,Apprentice,,,,,,,,,,,,,,,,,,,,,,,,,,,,,,,,,,,,,13477423993,,,,,,,,,0/0/00,,,0/0/00,,,,,,,,,,,,,,Unspecified,,,,,,,,,,,,,,,Low,,,,Normal,,,,,,
,Angel/,,yellowrat,,,,,,,,,,,,,,,,,,,,,,,,,,,,,,,,,,,,,17185673773,,,,,,,,,0/0/00,,,0/0/00,,,,,,,,,,,,,,Unspecified,,,,,,,,,,,,,,,Low,,,,Normal,,,,,,
,Angela,,Friedman,,,,,,,,,,,,,,,,,,,,,,,,,,,,,,,,,,,,,,,,,,,,,,0/0/00,,,0/0/00,,,,,angelafriedman@hotmail.com,SMTP,Angela Friedman (angelafriedman@hotmail.com),angelafriedman@hotmail.com,SMTP,Angela Friedman (angelafriedman@hotmail.com),angelafriedman@hotmail.com,SMTP,Angela Friedman (angelafriedman@hotmail.com),Unspecified,,,,,,,,,,,,,,,Low,,,,Normal,,,,,,
,anita,,RES3200,,,,,,,,,,,,,,,,,,,,,,,,,,,,,,,,,,,,,,,,,,,,,,0/0/00,,,0/0/00,,,,,chynad0ll770@hotmail.com,SMTP,anita RES3200 (chynad0ll770@hotmail.com),,,,,,,Unspecified,,,,,,,,,,,,,,,Low,,,,Normal,,,,,,
,Ann,Marie,Reyes,,,,,,,,,,,,,,,,,,,,,,,,,,,,,,,,,,,,,,,,,,,,,,0/0/00,,,0/0/00,,,,,annr@ckdny.com,SMTP,Ann Marie Reyes (annr@ckdny.com),,,,,,,Unspecified,,,,,,,,,,,,,,,Low,,,,Normal,,,,,,
,Anna,,Aulova,,,,,,,,,,,,,,,,,,,,,,,,,,,,,,,,,,,,,,,,,,,,,,0/0/00,,,0/0/00,,,,,aaulova@yahoo.com,SMTP,Anna Aulova (aaulova@yahoo.com),,,,,,,Unspecified,,,,,,,,,,,,,,,Low,,,,Normal,,,,,,
,Anna,,,,Commercial Kitchen Design,,,,,,,,,,,,,,,,,,,,,,,,,,7183861086,,,,,7183861042,,,,,,,,,,,,,0/0/00,,,0/0/00,,,,,,,,,,,,,,Unspecified,,,,,,,,,,,,,,,Low,,,,Normal,,,,,,
,Anna babanna,,Hanball with breads,,,,,,,,,,,,,,,,,,,,,,,,,,,,+1 9176538859,,,,,,,,,,,,,,,,,,0/0/00,,,0/0/00,,,,,,,,,,,,,,Unspecified,,,,,,,,,,,,,,,Low,,,,Normal,,,,,,
,anna,,thomas,,,,,"


",,,,,,,"


",,,,,,,,,,,,,,,,,,,,,,,,,,,,,,,,,,0/0/00,,,0/0/00,,,,,anna.thomas@siteterra.com,SMTP,anna.thomas@siteterra.com (anna.thomas@siteterra.com),,,,,,,Unspecified,,,,,,,,,,,,,,,Low,,,,Normal,,,,,,
,Annie,,"Nieghbor, joe's mom",,,,,,,,,,,,,,,,,,,,,,,,,,,,3476337873,,,,,,,,,,,,,,,,,,0/0/00,,,0/0/00,,,,,,,,,,,,,,Unspecified,,,,,,,,,,,,,,,Low,,,,Normal,,,,,,
,Anthony,,Owner Of 1652 E12 ST,,,,,,,,,,,,,,,,,,,,,,,,,,,,,,,,,,,,,(917) 916-5248,,,,,,,,,0/0/00,,,0/0/00,,Completed-Project,,,,,,,,,,,,Unspecified,,,,,,,,,,,,,,,Low,,,,Normal,,,,,,
,Anthony,,Hernandez,,,,,,,,,,,,,,,,,,,,,,,,,,,,,,,,,,,,,,,,,,,,,,0/0/00,,,0/0/00,,,,,hernandez.anthony@gmail.com,SMTP,Anthony Hernandez (hernandez.anthony@gmail.com),,,,,,,Unspecified,,,,,,,,,,,,,,,Low,,,,Normal,,,,,,
,Anthony J.,,D'Agosto,,,,,,,,,,,,,,,,,,,,,,,,,,,,,,,,,,,,,,,,,,,,,,0/0/00,,,0/0/00,,,,,anthonyd@212hardware.com,SMTP,Anthony J. D'Agosto (anthonyd@212hardware.com),,,,,,,Unspecified,,,,,,,,,,,,,,,Low,,,,Normal,,,,,,